{"text_format":"1","workbook":"xlsx","n_sheets":7,"sheets":["Instruction","Parametre","Fuzzy CRR","Resultat","Eurib12M","ImpVolCAC40","delta_gamma"],"not_rendered":{"charts":5,"images":2,"macros":1,"external_links":0,"defined_names":7,"comments":1,"pivot_tables":0},"unopened":[],"bounds":{"document_bytes":16777216,"sheet_cells":100000,"rows_first":2000,"rows_last":500,"rows_between":2000,"halvings":0,"cell_chars":16384,"cell_head_chars":4096},"cells_cut":0,"cells_raw":0,"read":"whole","date_system":"1900"}

{"sheet":"Instruction","index":0,"n_rows":13,"n_cols":2,"rows_kept":13,"cut":false,"hidden":false,"merged":[[17,14,18,14]]}
[]
[]
[]
[]
[]
[]
[]
[]
[]
[]
[]
[]
[null,"Présentation de l'onglet Paramètre"]

{"sheet":"Parametre","index":1,"n_rows":13,"n_cols":8,"rows_kept":13,"cut":false,"hidden":false,"merged":[[0,0,0,1],[7,0,7,1]]}
["Lattice Parameters"]
["Initial Price",100]
["Maturity (years)",3,null,null,-75.065459498200468,0.45648274036664788,-70.530734620269982,0.33311676109837729]
["volatility",{"$f":"ImpVolCAC40!D680","v":0.13865},null,3.0055359687439553E-2]
["# Periods (multiple of T)",3]
["r",1.3699999999999999E-3]
["Div-Yield",0]
["Option Parameters"]
["Call / Put",1]
["Strike (manuel)",110]
["Strike min",55]
["Strike max",145]
["ΔStrike",0.5]

{"sheet":"Fuzzy CRR","index":2,"n_rows":23,"n_cols":17,"rows_kept":23,"cut":false,"hidden":false,"merged":[[0,0,0,1]]}
["Fuzzy Parameters",null,null,null,null,"Résultat",null,"Détail"]
["rho",{"$f":"ImpVolCAC40!$D$1","v":7.8507032095203794E-2},null,null,null,"Prix",{"$f":"$I$4 + (($I$2 - $I$4) + ($I$3 - $I$4 )) / 3","v":6.5473755299765379},"Prix H",{"$f":"B23","v":8.7616950160225144}]
["Rl",{"$f":"INDIRECT(\"Eurib12M!C\"&Eurib12M!D2)/100","v":-1.8599999999999999E-3},"ul",{"$f":"EXP((1-$B$2)*Parametre!$B$4*SQRT(Parametre!$B$3/Parametre!$B$5))","v":1.1362859441220381},null,"Ecart",{"$f":"$G$2/$I$3 - 1","v":8.8740302081739886E-2},"Prix M",{"$f":"H23","v":6.0137165102252066}]
["Rm",{"$f":"Parametre!B6","v":1.3699999999999999E-3},"um",{"$f":"EXP(Parametre!$B$4*SQRT(Parametre!$B$3/Parametre!$B$5))","v":1.1487219769442443},null,null,null,"Prix L",{"$f":"N23","v":4.8667150636818919}]
["Rh",{"$f":"INDIRECT(\"Eurib12M!C\"&Eurib12M!D1)/100","v":1.9470000000000001E-2},"uh",{"$f":"EXP((1+$B$2)*Parametre!$B$4*SQRT(Parametre!$B$3/Parametre!$B$5))","v":1.161294115394752}]
["Ph",{"$f":"IF(Parametre!$B$9=1,(EXP($B$5*Parametre!$B$3/Parametre!$B$5)-$D$8)/($D$5-$D$8),(EXP($B$3*Parametre!$B$3/Parametre!$B$5)-$D$8)/($D$5-$D$8))","v":0.52818111003185952},"dl",{"$f":"1/D3","v":0.88006016898559747}]
["Pm",{"$f":"(EXP($B$4*Parametre!$B$3/Parametre!$B$5)-$D$7)/($D$4-$D$7)","v":0.47032100111237896},"dm",{"$f":"1/D4","v":0.8705326615758977}]
["Pl",{"$f":"IF(Parametre!$B$9=1,(EXP($B$3*Parametre!$B$3/Parametre!$B$5)-$D$6)/($D$3-$D$6),(EXP($B$5*Parametre!$B$3/Parametre!$B$5)-$D$6)/($D$3-$D$6))","v":0.46084965370695613},"dh",{"$f":"1/D5","v":0.86110829870181138}]
[]
[]
["Fuzzy Stock H",null,null,null,null,null,"Stock M",null,null,null,null,null,"Fuzzy Stock L"]
[null,0,1,2,3,null,null,0,1,2,3,null,null,0,1,2,3]
[3,null,{"$f":"IF($A13<C$12,$D$8*OFFSET(C13,0,-1),IF($A13=C$12,$D$5*OFFSET(C13,1,-1),\"\"))","v":""},"",156.61259152694342,null,3,null,{"$f":"IF($G13<I$12,$D$7*OFFSET(I13,0,-1),IF($G13=I$12,$D$4*OFFSET(I13,1,-1),\"\"))","v":""},"",151.58100764719515,null,3,null,{"$f":"IF($M13<O$12,$D$6*OFFSET(O13,0,-1),IF($M13=O$12,$D$3*OFFSET(O13,1,-1),\"\"))","v":""},"",146.71107639123724]
[2,null,"",134.86040224504796,116.1294115394752,null,2,null,"",131.95621803146929,114.87219769442443,null,2,null,"",129.11457468093116,113.62859441220382]
[1,null,116.1294115394752,99.999999999999986,86.110829870181121,null,1,null,114.87219769442443,100,87.053266157589775,null,1,null,113.62859441220381,100,88.00601689855975]
[0,100,{"$f":"IF($A16<C$12,$D$8*OFFSET(C16,0,-1),IF($A16=C$12,$D$5*OFFSET(C16,1,-1),\"\"))","v":86.110829870181135},74.150750209312804,63.851826360204335,null,0,100,{"$f":"IF($G16<I$12,$D$7*OFFSET(I16,0,-1),IF($G16=I$12,$D$4*OFFSET(I16,1,-1),\"\"))","v":87.053266157589775},75.782711487041652,65.97132553225272,null,0,100,{"$f":"IF($M16<O$12,$D$6*OFFSET(O16,0,-1),IF($M16=O$12,$D$3*OFFSET(O16,1,-1),\"\"))","v":88.00601689855975},77.450590103495841,68.161179414516795]
[]
["Fuzzy Payoff H",null,null,null,null,null,"Payoff M",null,null,null,null,null,"Fuzzy Payoff L"]
[null,0,1,2,3,null,null,0,1,2,3,null,null,0,1,2,3]
[3,{"$f":"IF(Parametre!$B$9=1,IF($A20<= B$19, ($B$6*C19+(1-$B$6)*C20)/EXP($B$5*Parametre!$B$3/Parametre!$B$5),\"\"),IF($A20<=B$19, ($B$6*C19+(1-$B$6)*C20)/EXP($B$3*Parametre!$B$3/Parametre!$B$5),\"\"))","v":""},{"$f":"IF(Parametre!$B$9=1,IF($A20<= C$19, ($B$6*D19+(1-$B$6)*D20)/EXP($B$5*Parametre!$B$3/Parametre!$B$5),\"\"),IF($A20<=C$19, ($B$6*D19+(1-$B$6)*D20)/EXP($B$3*Parametre!$B$3/Parametre!$B$5),\"\"))","v":""},{"$f":"IF(Parametre!$B$9=1,IF($A20<= D$19, ($B$6*E19+(1-$B$6)*E20)/EXP($B$5*Parametre!$B$3/Parametre!$B$5),\"\"),IF($A20<=D$19, ($B$6*E19+(1-$B$6)*E20)/EXP($B$3*Parametre!$B$3/Parametre!$B$5),\"\"))","v":""},{"$f":"MAX(Parametre!$B$9*(E13-Parametre!$B$10),0)","v":46.612591526943419},null,3,{"$f":"IF($G20<= H$19, ($B$7*I19+(1-$B$7)*I20)/EXP($B$4*Parametre!$B$3/Parametre!$B$5),\"\")","v":""},{"$f":"IF($G20<= I$19, ($B$7*J19+(1-$B$7)*J20)/EXP($B$4*Parametre!$B$3/Parametre!$B$5),\"\")","v":""},{"$f":"IF($G20<= J$19, ($B$7*K19+(1-$B$7)*K20)/EXP($B$4*Parametre!$B$3/Parametre!$B$5),\"\")","v":""},{"$f":"MAX(Parametre!$B$9*(K13-Parametre!$B$10),0)","v":41.58100764719515},null,3,{"$f":"IF(Parametre!$B$9=1,IF($M20<= N$19, ($B$8*O19+(1-$B$8)*O20)/EXP($B$3*Parametre!$B$3/Parametre!$B$5),\"\"),IF($M20<=N$19, ($B$8*O19+(1-$B$8)*O20)/EXP($B$5*Parametre!$B$3/Parametre!$B$5),\"\"))","v":""},{"$f":"IF(Parametre!$B$9=1,IF($M20<= O$19, ($B$8*P19+(1-$B$8)*P20)/EXP($B$3*Parametre!$B$3/Parametre!$B$5),\"\"),IF($M20<=O$19, ($B$8*P19+(1-$B$8)*P20)/EXP($B$5*Parametre!$B$3/Parametre!$B$5),\"\"))","v":""},{"$f":"IF(Parametre!$B$9=1,IF($M20<= P$19, ($B$8*Q19+(1-$B$8)*Q20)/EXP($B$3*Parametre!$B$3/Parametre!$B$5),\"\"),IF($M20<=P$19, ($B$8*Q19+(1-$B$8)*Q20)/EXP($B$5*Parametre!$B$3/Parametre!$B$5),\"\"))","v":""},{"$f":"MAX(Parametre!$B$9*(Q13-Parametre!$B$10),0)","v":36.711076391237242}]
{"$rows_left_out":4}
{"sheet":"Resultat","index":3,"n_rows":183,"n_cols":21,"rows_kept":183,"cut":false,"hidden":false,"merged":[]}
["Call",null,null,null,null,null,null,null,null,null,null,"Put"]
[null,"Strike","Prix","Ecart Relatif","VAR","Ecart VAR","RM VAR","ES","Ecart ES","RM ES",null,null,"Strike","Prix","Ecart Relatif","VAR","Ecart VAR","RM VAR","ES","Ecart ES","RM ES"]
[null,55,46.041833733895842,1.7271035339722296E-2,-73.85397877558141,6.5906584320714723E-2,0.74992682107963049,-69.332278412980585,4.9063039761369609E-2,0.69763876860493079,null,null,55,3.8214930135559218E-2,0.10581747617674719,-9.1243999451875654E-3,-2.9663200892437236E-2,0.2849132036853303,-8.7402485868240468E-3,-2.5878588546993653E-2,0.31991852954768285]
[null,55.5,45.554954643368347,1.7603882271685745E-2,-73.85397877558141,6.5906584320714723E-2,0.74992682107963049,-69.332278412980585,4.9063039761369609E-2,0.69763876860493079,null,null,55.5,4.3055618489341516E-2,9.70476668208482E-2,-1.3652251640423118E-2,-2.9612058348531534E-2,0.28482240260751007,-1.3078559005363822E-2,-2.5841983709593452E-2,0.31979906665908325]
[null,56,45.068293750531204,1.7934023882114181E-2,-73.85397877558141,6.5906584320714723E-2,0.74992682107963049,-69.332278412980585,4.9063039761369609E-2,0.69763876860493079,null,null,56,4.8114504533496569E-2,7.9039422512205526E-2,-1.8180103335658671E-2,-2.9586388419372889E-2,0.28477667957968317,-1.7416869423903598E-2,-2.5823613391350753E-2,0.31973892606553594]
[null,56.5,44.582032799012218,1.8280729517980321E-2,-73.85397877558141,6.5906584320714723E-2,0.74992682107963049,-69.332278412980585,4.9063039761369609E-2,0.69763876860493079,null,null,56.5,5.3349681417058897E-2,6.8415776445092114E-2,-2.2707955030894091E-2,-2.957095474529603E-2,0.28474914168565391,-2.175517984244325E-2,-2.5812569375750383E-2,0.3197027097039758]
[null,57,44.09623309266545,1.8645980798939421E-2,-73.85397877558141,6.5906584320714723E-2,0.74992682107963049,-69.332278412980585,4.9063039761369609E-2,0.69763876860493079,null,null,57,5.9365710806858915E-2,7.3972230069085709E-2,-2.7235806726129651E-2,-2.9560652379968189E-2,0.28473073951823402,-2.6093490260983031E-2,-2.5805197582558947E-2,0.3196785102089269]
[null,57.5,43.611300920569875,1.8994767926816758E-2,-73.85397877558141,6.5906584320714723E-2,0.74992682107963049,-69.332278412980585,4.9063039761369609E-2,0.69763876860493079,null,null,57.5,6.6441198463369072E-2,6.2786040844798885E-2,-3.1763658421365207E-2,-2.9553287047401566E-2,0.28471757370667444,-3.0431800679522805E-2,-2.5799927543842638E-2,0.31966119771245083]
[null,58,43.126736949871642,1.934913304723751E-2,-73.85397877558141,6.5906584320714723E-2,0.74992682107963049,-69.332278412980585,4.9063039761369609E-2,0.69763876860493079,null,null,58,7.3769658529464002E-2,5.0537538280121863E-2,-3.6291510116600756E-2,-2.9547759489062853E-2,0.28470768761642351,-3.4770111098062585E-2,-2.5795972566370562E-2,0.31964819846572934]
[null,58.5,42.642580006931041,1.9721540187651376E-2,-73.85397877558141,6.5906584320714723E-2,0.74992682107963049,-69.332278412980585,4.9063039761369609E-2,0.69763876860493079,null,null,58.5,8.1284984775887942E-2,4.3109152568260534E-2,-4.0819361811836374E-2,-2.9543458166223835E-2,0.28469999147204988,-3.9108421516602425E-2,-2.5792895020658624E-2,0.31963807911259423]
[null,59,42.158792112164726,2.0111712424677686E-2,-73.85397877558141,6.5906584320714723E-2,0.74992682107963049,-69.332278412980585,4.9063039761369609E-2,0.69763876860493079,null,null,59,8.9447180521530306E-2,4.4571736916194427E-2,-4.534721350707193E-2,-2.9540015777268391E-2,0.28469383016445476,-4.3446731935142202E-2,-2.5790432068668157E-2,0.31962997806194826]
[null,59.5,41.676447735374275,2.0477934705350531E-2,-73.85397877558141,6.5906584320714723E-2,0.74992682107963049,-69.332278412980585,4.9063039761369609E-2,0.69763876860493079,null,null,59.5,9.9450047459158628E-2,3.5041519758438389E-2,-4.9875065202307486E-2,-2.9537198396958786E-2,0.28468878618791305,-4.7785042353681986E-2,-2.5788416320587149E-2,0.31962334624473321]
[null,60,41.194824876618114,2.0859359173321712E-2,-73.771726632417483,6.5914373298308515E-2,0.74993268649529943,-69.254771307099062,4.9068789562979775E-2,0.69764493805030992,null,null,60,0.10987717492261342,2.6971600040562427E-2,-5.4402916897543036E-2,-2.9534849974598321E-2,0.28468458087419413,-5.212335277222175E-2,-2.5786736114036368E-2,0.31961781719510335]
[null,60.5,40.713486850916567,2.1257248071404167E-2,-73.624728742505113,6.5921816094890007E-2,0.74993829018476443,-69.11649656812213,4.9074283840226274E-2,0.69765083233113856,null,null,60.5,0.12044050024407017,2.1550168012447912E-2,-7.1519829465833046E-2,-2.9503186747760424E-2,0.28462780017553779,-6.8526569775503726E-2,-2.5764083765151491E-2,0.31954317162814583]
[null,61,40.232178311340363,2.1665727955505032E-2,-73.477730852592728,6.5929288775817829E-2,0.7499439153540618,-68.978221829145198,4.9079800203184698E-2,0.6976567493315311,null,null,61,0.13105374289846519,1.7434512491891319E-2,-8.8636742034123028E-2,-2.9483751662962354E-2,0.28459287255807375,-8.492978677878571E-2,-2.5750180978855508E-2,0.319497262518392]
[null,61.5,39.753143539740535,2.2056017867382538E-2,-73.330732962680344,6.5936791521441718E-2,0.74994956212693153,-68.83994709016828,4.9085338785292532E-2,0.69766268918310181,null,null,61.5,0.14475264000878474,1.2096854703218529E-2,-0.10575365460241304,-2.9470607525133308E-2,0.28456921812304603,-0.10133300378206769,-2.5740778977439538E-2,0.31946617431543534]
[null,62,39.275433291654046,2.2465271726929359E-2,-73.183735072767988,6.5944324513565578E-2,0.74995523062806602,-68.701672351191348,4.909089972106373E-2,0.69766865201848061,null,null,62,0.15927052701152752,6.835105407290154E-3,-0.12287056717070305,-2.9461125346101014E-2,0.28455213748226044,-0.11773622078534968,-2.5733996670048054E-2,0.3194437275065814]
[null,62.5,38.797869745911562,2.2888811580003887E-2,-73.036737182855603,6.5951887935461695E-2,0.74996092098312006,-68.56339761221443,4.9096483146101599E-2,0.69767463797132845,null,null,62.5,0.17386147577802841,2.9155026937228712E-3,-0.13998747973899303,-2.9453961903435855E-2,0.28453922458705821,-0.13413943778863166,-2.572887304652105E-2,0.31942675874764104]
[null,63,38.320306200169092,2.3323272363247938E-2,-72.889739292943233,6.5959481971887168E-2,0.74996663331871949,-68.425122873237498,4.9102089197106791E-2,0.69768064717634315,null,null,63,0.18845242454452935,-3.7343145633883523E-4,-0.15710439230728304,-2.944835933671186E-2,0.28452911988532636,-0.15054265479191362,-2.5724865931560426E-2,0.31941348078206955]
[null,63.5,37.844514349077649,2.3731896586075552E-2,-72.742741403030848,6.5967106809096121E-2,0.74997236776246856,-68.286848134260566,4.9107718011891066E-2,0.69768667976927135,null,null,63.5,0.20528962676101439,-7.1253280044568656E-3,-0.17422130487557302,-2.9443857606217261E-2,0.28452099716120555,-0.1669458717951956,-2.5721646228495265E-2,0.31940280756944694]
{"$rows_left_out":164}
{"sheet":"Eurib12M","index":4,"n_rows":45,"n_cols":6,"rows_kept":45,"cut":false,"hidden":false,"merged":[]}
["lambda",0.9,"row_max_wP",{"$f":"MATCH(MAX($F$7:$F$45),$F$5:$F$45,0)+4","v":31},"max_P",{"$f":"MAX($C$7:$C$45)","v":5.4950000000000001}]
["n",{"$f":"COUNT($D$7:$D$45)","v":39},"row_min_wP",{"$f":"MATCH(MIN($F$7:$F$45),$F$5:$F$45,0)+4","v":7},"min_P",{"$f":"MIN($C$7:$C$45)","v":-0.186}]
[]
["No","Date","Prix Ask","T","wi","w_Prix"]
[1,"2018-06-05",-0.182,{"$f":"($B$5-B5)/365","v":0},{"$f":"$B$1^($A5-1)*(1-$B$1)/(1-$B$1^$B$2)","v":0.10166974285310838},{"$f":"$E5*$C5","v":-1.8503893199265726E-2}]
[2,"2018-03-30",-0.19,0.18356164383561643,9.1502768567797543E-2,-1.7385526027881532E-2]
[3,"2017-12-29",-0.186,0.43287671232876712,8.2352491711017786E-2,-1.5317563458249308E-2]
[4,"2017-09-29",-0.17199999999999999,0.68219178082191778,7.4117242539916015E-2,-1.2748165716865554E-2]
[5,"2017-06-30",-0.156,0.93150684931506844,6.6705518285924428E-2,-1.0406060852604211E-2]
[6,"2017-03-31",-0.109,1.1808219178082191,6.003496645733198E-2,-6.5438113438491862E-3]
[7,"2016-12-30",-8.2000000000000003E-2,1.4301369863013698,5.4031469811598787E-2,-4.4305805245511004E-3]
[8,"2016-09-30",-6.4000000000000001E-2,1.6794520547945206,4.8628322830438907E-2,-3.1122126611480899E-3]
[9,"2016-06-30",-5.0999999999999997E-2,1.9315068493150684,4.3765490547395015E-2,-2.2320400179171454E-3]
[10,"2016-03-31",-5.0000000000000001E-3,2.1808219178082191,3.9388941492655517E-2,-1.9694470746327758E-4]
[11,"2015-12-31",0.06,2.43013698630137,3.5450047343389968E-2,2.1270028406033979E-3]
[12,"2015-09-30",0.14199999999999999,2.6821917808219178,3.1905042609050978E-2,4.5305160504852384E-3]
[13,"2015-06-30",0.16400000000000001,2.9342465753424656,2.8714538348145878E-2,4.7091842890959242E-3]
[14,"2015-03-31",0.19800000000000001,3.1835616438356165,2.5843084513331293E-2,5.1169307336395966E-3]
[15,"2014-12-31",0.32500000000000001,3.43013698630137,2.3258776061998162E-2,7.5591022201494029E-3]
[16,"2014-09-30",0.33800000000000002,3.6821917808219178,2.0932898455798345E-2,7.075319678059841E-3]
{"$rows_left_out":26}
{"sheet":"ImpVolCAC40","index":5,"n_rows":680,"n_cols":4,"rows_kept":680,"cut":false,"hidden":false,"merged":[]}
["max",{"$f":"MAX($D$5:$D$680)","v":0.14396},"rho",{"$f":"($B$1-$B$2)/(2*$D$680)","v":7.8507032095203794E-2}]
["min",{"$f":"MIN($D$5:$D$680)","v":0.12218999999999999}]
[]
["No","Date     ","Dernier","Prix      "]
[1,"2018-06-05","03:04:00      ",0.13509000000000002]
[2,"2018-06-05","03:05:00      ",0.13586999999999999]
[3,"2018-06-05","03:06:00      ",0.13557]
[4,"2018-06-05","03:07:00      ",0.13525000000000001]
[5,"2018-06-05","03:08:00      ",0.13463]
[6,"2018-06-05","03:09:00      ",0.13428000000000001]
[7,"2018-06-05","03:10:00      ",0.13430999999999998]
[8,"2018-06-05","03:11:00      ",0.13446999999999998]
[9,"2018-06-05","03:12:00      ",0.13433999999999999]
[10,"2018-06-05","03:13:00      ",0.13323000000000002]
[11,"2018-06-05","03:14:00      ",0.13347000000000001]
[12,"2018-06-05","03:15:00      ",0.13342000000000001]
[13,"2018-06-05","03:16:00      ",0.13352]
[14,"2018-06-05","03:17:00      ",0.13336999999999999]
[15,"2018-06-05","03:18:00      ",0.13308999999999999]
[16,"2018-06-05","03:19:00      ",0.13300000000000001]
{"$rows_left_out":661}
{"sheet":"delta_gamma","index":6,"n_rows":51,"n_cols":7,"rows_kept":51,"cut":false,"hidden":false,"merged":[]}
["Call",null,null,null,"put"]
["Axe Y","Axe X","Axe X",null,"Axe Y","Axe X","Axe X"]
["Moneyness","Echéance","36M",null,"Moneyness","Echéance","36M"]
[60,"Volatilité","10.000%",null,55,"Volatilité","10.000%"]
[null,"Prix (total)",0,null,null,"Prix (total)",0]
[null,"Delta",99.88,null,null,"Delta",-0.02]
[null,"Gamma",2.2800000000000001E-2,null,null,"Gamma",4.4000000000000003E-3]
[80,"Volatilité","10.000%",null,60,"Volatilité","10.000%"]
[null,"Prix (total)",0,null,null,"Prix (total)",0]
[null,"Delta",91.59,null,null,"Delta",-0.12]
[null,"Gamma",0.89070000000000005,null,null,"Gamma",2.2800000000000001E-2]
[105,"Volatilité","10.000%",null,65,"Volatilité","10.000%"]
[null,"Prix (total)",0,null,null,"Prix (total)",0]
[null,"Delta",42.43,null,null,"Delta",-0.5]
[null,"Gamma",2.2601,null,null,"Gamma",8.3400000000000002E-2]
[110,"Volatilité","10.000%",null,70,"Volatilité","10.000%"]
[null,"Prix (total)",0,null,null,"Prix (total)",0]
[null,"Delta",32.299999999999997,null,null,"Delta",-1.58]
[null,"Gamma",2.0712000000000002,null,null,"Gamma",0.22900000000000001]
[115,"Volatilité","10.000%",null,75,"Volatilité","10.000%"]
{"$rows_left_out":31}